Error Occurred Loading Library Libclntsh.so.10.1

RECOMMENDED: If you have Windows errors then we strongly recommend that you download and run this (Windows) Repair Tool.

catch(e) { alert("Exception occurred in helloWorld. a maximum of 10 seconds for the page to fully load. If the page loads within 10 seconds, the function executes.

Error while loading shared libraries: libclntsh.so.11.1 : cannot open shared obj file no such file. When running from crontab. I complied my c++ program, its a proc.

After loading in a new informatica key, I am receiving the below error. I have confirmed that the library paths are correct. Not sure where to go from

Jul 14, 2011  · sqlplus: error while loading shared libraries: libclntsh.so.10.1: cannot open shared object file: No such file or directory error One moment please.

Award Cmos Checksum Error AMI/AMIT BIOS Post Codes – BIOS Central – NMI Disable: NMI interrupt line to the CPU is disabled by setting bit 7 I?O port 70h (CMOS) Power On Delay: Once the keyboard controller gets. This is a computer that has a BIOS ROM Checksum Error with Award. Trying To Fix Award BootBlock BIOS ROM Checksum. fix "CMOS checksum error. Error Codes/Beeps for AMI, Award, Compaq, IBM, Phoenix , BIOS's. 9 beeps ROM checksum error, faulty BIOS chip(s), must replace them 10 beeps CMOS. Provides procedures for resolving problems identified with beep codes during startup. Windows 7: CMOS bad checksum error

Before it was moved to Azure, BCWeb had undergone important architectural changes, including the implementation of network load balancing. This had security implications. Error message latency. If errors occurred, they were not.

The OCI8 shared extension oci8.so library will be created. If it happened, you \'ll have to reinstall all php packages (sadly I did):. if you get an error saying something about apache cannot load libclntsh.so.10.1, file not found, check the.

REP_51002 : Database driver event.Error occurred loading library [libclntsh.so.10.1: cannot open shared object file: No such file or directory].

Start-up Shutdown Scripts in Oracle Apps R12 – Oracle Trainings for. – Jun 10, 2007. In 11i web server oracle home was 1.0.2.2.2 but in R12 its 10.1.3). Exception occurred while preseeding variables in the context file: java.sql. error while loading shared libraries: libclntsh.so.10.1: cannot open shared.

The finished hardware design has the following specifications: Mr. Punpeng says the Nimitra is the result of his trial and error to create the ultimate. This,

Aspose.Diagram for.NET Aspose.Diagram is a class library for working with MS Visio files & is a pure.NET alternate.

Database driver event.Error occurred loading library[libclntsh.so.10.1 cannot open shared object file:. Error occurred loading library [pmora8.dll]

lrwxrwxrwx 1 oracle oinstall 58 May 29 17:36 libclntsh.so.10.1. Error occurred loading library [libdb2.so.1: cannot open shared object file:.

libclntsh.sl.10.1 libclntsh.so.10.1: can't open file: errno=2 can't open library:. runcbl: error while loading shared libraries: libclntsh.so: cannot open shared. value is nonzero, then an error has occurred Take appropriate action for the error.

libclntsh.so.10.1 error loading shared libraries. error while loading shared libraries: libclntsh.so.10.1:. LD_LIBRARY_PATH=/vol1/oracle/product/10_2/lib

MySQL 5.5, 5.6, 5.7, MariaDB 10.1, Amazon. Aurora. client may be installed without error on 64-bit Windows but HammerDB for 64-bit Windows will not be able. On Linux the library is called libclntsh.so where this is typically a symbolic link to a product specific name. couldn't load library "C:/Program Files/ HammerDB-.

Jul 14, 2009  · listener Error error while loading shared libraries:. # echo $LD_LIBRARY_PATH. does libclntsh.so.10.1 reside in /home/oracle/OraHome10g/lib

Error occurred loading library [libclntsh.so.10.1:. Error occurred loading library [libclntsh.so.10.1:. 154459: People who viewed.

Apr 1, 2011. Hi i`m getting the following error while assigning oracle tables in unix 2? libname REP Oracle SCHEMA=CREP. Community, Category, Board, Library, Users. ERROR: Could not load. loaded) ERROR: ld.so.1: sas: fatal: libclntsh.so.10.1: open failed: No such file or. An Unexpected Error has occurred.

How To Calculate Bit Error Rate In Matlab This paper will discuss simulation of bit error rate using a tool Matlab. With the SNR and energy-per-bit now known, we are ready to calculate N0, the one-. Error 534 Pestartprintjob Error 534 detected by database DLL Execute <PEStartPrintJob> –.DLL-Execute-PEStartPrintJob.html copy. Incidentally the error message comes up almost immediately, whereas the rogue record took some time to find. Is Crystal Err 534 PEStartPrintJob a rebish error – Business Objects. – I've Err 534 PEStartPrintJob (with sometimes [Level 2]). I've to mention that the database is located on Novell (or W2K) Server. Hi I have SalesLogix 5.2.5 running on Citrix Server.

. error while loading shared. Failed To Link libclntsh.so.11.1" 2. The "sqlplus: error while loading shared libraries" error can happen because DBCA.

RECOMMENDED: Click here to fix Windows errors and improve system performance